1 Aug
2012
1 Aug
'12
7:05 a.m.
Hi, I'm getting some tests failed on emacs 24.1.3 (fedora 17): 3 unexpected results: FAILED evil-test-forward-word-begin FAILED evil-test-type-modifiers FAILED evil-test-visual-line I'm attaching the full output. Regards, Sanel