Q versiones de Perl y GCC estas usando???
Anda perfecto en Gentoo estoy probando pero la verdad no es muy comodo que digamos, al menos haria falta acostumbrarse :P
Y esto es lo que da en la otra:
### emCore ###
### emFileMan ###
### emMain ###
### emSendMiniIpc ###
### emShowStdDlg ###
### emWnds ###
### emX11 ###
gcc -O2 -fPIC -fexceptions -fmessage-length=0 -Wall -Winline -Wpointer-arith -Wredundant-decls -Wsign-compare -Wwrite-strings -Wsign-promo -Wsynth -Wstrict-aliasing=2 -Wno-invalid-offsetof -Iinclude -I/usr/X11R6/include -c src/emX11/emX11Clipboard.cpp -o obj/emX11Clipboard.o
En el fichero incluído de include/emX11/emX11Clipboard.h:29,
de src/emX11/emX11Clipboard.cpp:21:
include/emX11/emX11Screen.h:25:22: error: X11/Xlib.h: No existe el fichero ó directorio
include/emX11/emX11Screen.h:29:23: error: X11/Xutil.h: No existe el fichero ó directorio
src/emX11/emX11Clipboard.cpp:22:23: error: X11/Xatom.h: No existe el fichero ó directorio
In file included from include/emX11/emX11Screen.h:33,
from include/emX11/emX11Clipboard.h:29,
from src/emX11/emX11Clipboard.cpp:21:
include/emX11/emX11ExtDynamic.h:45: error: ‘Bool’ no nombra a un tipo
include/emX11/emX11ExtDynamic.h:46: error: ISO C++ prohíbe la declaración de ‘Display’ sin tipo
include/emX11/emX11ExtDynamic.h:46: error: expected ‘;’ before ‘*’ token
include/emX11/emX11ExtDynamic.h:47: error: ‘Drawable’ no nombra a un tipo
include/emX11/emX11ExtDynamic.h:58: error: ‘Bool’ no nombra a un tipo
In file included from include/emX11/emX11Clipboard.h:29,
from src/emX11/emX11Clipboard.cpp:21:
include/emX11/emX11Screen.h:78: error: ‘Cursor’ en el espacio de nombres ‘::’ no nombra un tipo
include/emX11/emX11Screen.h:86: error: expected ‘,’ or ‘...’ before ‘&’ token
include/emX11/emX11Screen.h:86: error: ISO C++ prohíbe la declaración de ‘XEvent’ sin tipo
include/emX11/emX11Screen.h:90: error: ‘Bool’ no nombra a un tipo
include/emX11/emX11Screen.h:96: error: ‘Cursor’ en el espacio de nombres ‘::’ no nombra un tipo
include/emX11/emX11Screen.h:98: error: ‘KeySym’ no se ha declarado
include/emX11/emX11Screen.h:100: error: ‘Display’ no se ha declarado
include/emX11/emX11Screen.h:100: error: ‘XErrorEvent’ no se ha declarado
include/emX11/emX11Screen.h:102: error: ISO C++ prohíbe la declaración de ‘Display’ sin tipo
include/emX11/emX11Screen.h:102: error: expected ‘;’ before ‘*’ token
include/emX11/emX11Screen.h:103: error: ‘XIM’ no nombra a un tipo
include/emX11/emX11Screen.h:107: error: ‘Window’ no nombra a un tipo
include/emX11/emX11Screen.h:108: error: ISO C++ prohíbe la declaración de ‘Visual’ sin tipo
include/emX11/emX11Screen.h:108: error: expected ‘;’ before ‘*’ token
include/emX11/emX11Screen.h:110: error: ‘Colormap’ no nombra a un tipo
include/emX11/emX11Screen.h:111: error: ‘Atom’ no nombra a un tipo
include/emX11/emX11Screen.h:112: error: ‘Atom’ no nombra a un tipo
include/emX11/emX11Screen.h:113: error: ‘Atom’ no nombra a un tipo
include/emX11/emX11Screen.h:118: error: ISO C++ prohíbe la declaración de ‘XImage’ sin tipo
include/emX11/emX11Screen.h:118: error: expected ‘;’ before ‘*’ token
include/emX11/emX11Screen.h:128: error: ‘Time’ no nombra a un tipo
In file included from src/emX11/emX11Clipboard.cpp:21:
include/emX11/emX11Clipboard.h:52: error: ISO C++ prohíbe la declaración de ‘XSelectionEvent’ sin tipo
include/emX11/emX11Clipboard.h:52: error: expected ‘;’ before ‘*’ token
include/emX11/emX11Clipboard.h:54: error: ‘XEvent’ no se ha declarado
include/emX11/emX11Clipboard.h:56: error: ‘XSelectionClearEvent’ no se ha declarado
include/emX11/emX11Clipboard.h:57: error: ‘XSelectionRequestEvent’ no se ha declarado
include/emX11/emX11Clipboard.h:58: error: ‘XSelectionEvent’ no se ha declarado
include/emX11/emX11Clipboard.h:61: error: ‘Display’ no se ha declarado
include/emX11/emX11Clipboard.h:61: error: ‘Window’ no se ha declarado
include/emX11/emX11Clipboard.h:61: error: ‘Atom’ no se ha declarado
include/emX11/emX11Clipboard.h:62: error: ‘Atom’ no se ha declarado
include/emX11/emX11Clipboard.h:62: error: ‘Atom’ no se ha declarado
include/emX11/emX11Clipboard.h:71: error: ISO C++ prohíbe la declaración de ‘Display’ sin tipo
include/emX11/emX11Clipboard.h:71: error: expected ‘;’ before ‘*’ token
include/emX11/emX11Clipboard.h:72: error: ‘Window’ en el espacio de nombres ‘::’ no nombra un tipo
include/emX11/emX11Clipboard.h:73: error: ‘Atom’ no nombra a un tipo
include/emX11/emX11Clipboard.h:74: error: ‘Atom’ no nombra a un tipo
include/emX11/emX11Clipboard.h:75: error: ‘Atom’ no nombra a un tipo
include/emX11/emX11Clipboard.h:76: error: ‘Atom’ no nombra a un tipo
include/emX11/emX11Clipboard.h:77: error: ‘Atom’ no nombra a un tipo
include/emX11/emX11Clipboard.h:79: error: ‘Time’ no nombra a un tipo
include/emX11/emX11Clipboard.h:81: error: ‘XSelectionEvent’ no nombra a un tipo
src/emX11/emX11Clipboard.cpp: In member function ‘virtual emInt64 emX11Clipboard::PutText(const emString&, bool)’:
src/emX11/emX11Clipboard.cpp:45: error: ‘LocalTimestamp’ no se declaró en este ámbito
src/emX11/emX11Clipboard.cpp:45: error: ‘class emX11Screen’ no tiene un miembro llamado ‘LastKnownTime’
src/emX11/emX11Clipboard.cpp:47: error: ‘Disp’ no se declaró en este ámbito
src/emX11/emX11Clipboard.cpp:47: error: ‘SelAtom’ no se declaró en este ámbito
src/emX11/emX11Clipboard.cpp:47: error: ‘None’ no se declaró en este ámbito
src/emX11/emX11Clipboard.cpp:47: error: ‘XSetSelectionOwner’ no se declaró en este ámbito
src/emX11/emX11Clipboard.cpp:50: error: ‘Disp’ no se declaró en este ámbito
src/emX11/emX11Clipboard.cpp:50: error: ‘SelAtom’ no se declaró en este ámbito
src/emX11/emX11Clipboard.cpp:50: error: ‘Win’ no se declaró en este ámbito
src/emX11/emX11Clipboard.cpp:50: error: ‘XSetSelectionOwner’ no se declaró en este ámbito
src/emX11/emX11Clipboard.cpp: In member function ‘virtual void emX11Clipboard::Clear(bool, emInt64)’:
src/emX11/emX11Clipboard.cpp:71: error: ‘Disp’ no se declaró en este ámbito
src/emX11/emX11Clipboard.cpp:71: error: ‘SelAtom’ no se declaró en este ámbito
src/emX11/emX11Clipboard.cpp:71: error: ‘XGetSelectionOwner’ no se declaró en este ámbito
src/emX11/emX11Clipboard.cpp:71: error: ‘Win’ no se declaró en este ámbito
src/emX11/emX11Clipboard.cpp:72: error: ‘None’ no se declaró en este ámbito
src/emX11/emX11Clipboard.cpp:72: error: ‘LocalTimestamp’ no se declaró en este ámbito
src/emX11/emX11Clipboard.cpp:72: error: ‘XSetSelectionOwner’ no se declaró en este ámbito
src/emX11/emX11Clipboard.cpp:74: error: ‘LocalTimestamp’ no se declaró en este ámbito
src/emX11/emX11Clipboard.cpp:74: error: ‘class emX11Screen’ no tiene un miembro llamado ‘LastKnownTime’
src/emX11/emX11Clipboard.cpp:79: error: ‘LocalTimestamp’ no se declaró en este ámbito
src/emX11/emX11Clipboard.cpp:79: error: ‘class emX11Screen’ no tiene un miembro llamado ‘LastKnownTime’
src/emX11/emX11Clipboard.cpp:80: error: ‘Disp’ no se declaró en este ámbito
src/emX11/emX11Clipboard.cpp:80: error: ‘SelAtom’ no se declaró en este ámbito
src/emX11/emX11Clipboard.cpp:80: error: ‘None’ no se declaró en este ámbito
src/emX11/emX11Clipboard.cpp:80: error: ‘XSetSelectionOwner’ no se declaró en este ámbito
src/emX11/emX11Clipboard.cpp: In member function ‘virtual emString emX11Clipboard::GetText(bool)’:
src/emX11/emX11Clipboard.cpp:87: error: ‘::Window’ no se ha declarado
src/emX11/emX11Clipboard.cpp:87: error: expected `;' before ‘w’
src/emX11/emX11Clipboard.cpp:91: error: ‘Atom’ no se declaró en este ámbito
src/emX11/emX11Clipboard.cpp:91: error: expected `;' before ‘target’
src/emX11/emX11Clipboard.cpp:92: error: expected initializer before ‘*’ token
src/emX11/emX11Clipboard.cpp:96: error: ‘w’ no se declaró en este ámbito
src/emX11/emX11Clipboard.cpp:96: error: ‘Disp’ no se declaró en este ámbito
src/emX11/emX11Clipboard.cpp:96: error: ‘SelAtom’ no se declaró en este ámbito
src/emX11/emX11Clipboard.cpp:96: error: ‘XGetSelectionOwner’ no se declaró en este ámbito
src/emX11/emX11Clipboard.cpp:97: error: ‘Win’ no se declaró en este ámbito
src/emX11/emX11Clipboard.cpp:98: error: ‘None’ no se declaró en este ámbito
src/emX11/emX11Clipboard.cpp:103: error: ‘MY_XA_TARGETS’ no se declaró en este ámbito
src/emX11/emX11Clipboard.cpp:105: error: ‘Win’ no se declaró en este ámbito
src/emX11/emX11Clipboard.cpp:106: error: ‘class emX11Screen’ no tiene un miembro llamado ‘LastKnownTime’
src/emX11/emX11Clipboard.cpp:107: error: ‘XConvertSelection’ no se declaró en este ámbito
src/emX11/emX11Clipboard.cpp:108: error: ‘se’ no se declaró en este ámbito
src/emX11/emX11Clipboard.cpp:108: error: ‘WaitSelectionEvent’ no se declaró en este ámbito
src/emX11/emX11Clipboard.cpp:109: error: ‘None’ no se declaró en este ámbito
src/emX11/emX11Clipboard.cpp:115: error: ‘XA_ATOM’ no se declaró en este ámbito
src/emX11/emX11Clipboard.cpp:116: error: ‘type’ no se declaró en este ámbito
src/emX11/emX11Clipboard.cpp:121: error: ‘target’ no se declaró en este ámbito
src/emX11/emX11Clipboard.cpp:123: error: ISO C++ prohíbe la declaración de ‘type name’ sin tipo
src/emX11/emX11Clipboard.cpp:123: error: ISO C++ prohíbe la declaración de ‘type name’ sin tipo
src/emX11/emX11Clipboard.cpp:123: error: expected primary-expression before ‘const’
src/emX11/emX11Clipboard.cpp:123: error: expected `)' before ‘const’
src/emX11/emX11Clipboard.cpp:126: error: expected `)' before ‘}’ token
src/emX11/emX11Clipboard.cpp:126: error: expected `)' before ‘}’ token
src/emX11/emX11Clipboard.cpp:126: error: expected primary-expression before ‘}’ token
src/emX11/emX11Clipboard.cpp:126: error: expected `;' before ‘}’ token
src/emX11/emX11Clipboard.cpp:129: error: ISO C++ prohíbe la declaración de ‘type name’ sin tipo
src/emX11/emX11Clipboard.cpp:129: error: ISO C++ prohíbe la declaración de ‘type name’ sin tipo
src/emX11/emX11Clipboard.cpp:129: error: expected primary-expression before ‘const’
src/emX11/emX11Clipboard.cpp:129: error: expected `)' before ‘const’
src/emX11/emX11Clipboard.cpp:132: error: expected `)' before ‘}’ token
src/emX11/emX11Clipboard.cpp:132: error: expected `)' before ‘}’ token
src/emX11/emX11Clipboard.cpp:132: error: expected primary-expression before ‘}’ token
src/emX11/emX11Clipboard.cpp:132: error: expected `;' before ‘}’ token
src/emX11/emX11Clipboard.cpp:137: error: ‘target’ no se declaró en este ámbito
src/emX11/emX11Clipboard.cpp:137: error: ‘XA_STRING’ no se declaró en este ámbito
src/emX11/emX11Clipboard.cpp:141: error: ‘target’ no se declaró en este ámbito
src/emX11/emX11Clipboard.cpp:141: error: ‘XA_STRING’ no se declaró en este ámbito
src/emX11/emX11Clipboard.cpp:147: error: ‘target’ no se declaró en este ámbito
src/emX11/emX11Clipboard.cpp:150: error: ‘class emX11Screen’ no tiene un miembro llamado ‘LastKnownTime’
src/emX11/emX11Clipboard.cpp:153: error: ‘None’ no se declaró en este ámbito
src/emX11/emX11Clipboard.cpp:161: error: ‘AnyPropertyType’ no se declaró en este ámbito
src/emX11/emX11Clipboard.cpp:162: error: ‘type’ no se declaró en este ámbito
src/emX11/emX11Clipboard.cpp:170: error: ‘XA_STRING’ no se declaró en este ámbito
src/emX11/emX11Clipboard.cpp:173: error: ‘MY_XA_UTF8_STRING’ no se declaró en este ámbito
src/emX11/emX11Clipboard.cpp: In constructor ‘emX11Clipboard::emX11Clipboard(emContext&, const emString&)’:
src/emX11/emX11Clipboard.cpp:182: error: ‘XSetWindowAttributes’ no se declaró en este ámbito
src/emX11/emX11Clipboard.cpp:182: error: expected `;' before ‘xswa’
src/emX11/emX11Clipboard.cpp:188: error: ‘Disp’ no se declaró en este ámbito
src/emX11/emX11Clipboard.cpp:188: error: ‘class emX11Screen’ no tiene un miembro llamado ‘Disp’
src/emX11/emX11Clipboard.cpp:190: error: ‘MY_XA_TARGETS’ no se declaró en este ámbito
src/emX11/emX11Clipboard.cpp:190: error: ‘False’ no se declaró en este ámbito
src/emX11/emX11Clipboard.cpp:190: error: ‘XInternAtom’ no se declaró en este ámbito
src/emX11/emX11Clipboard.cpp:191: error: ‘MY_XA_TIMESTAMP’ no se declaró en este ámbito
src/emX11/emX11Clipboard.cpp:192: error: ‘MY_XA_UTF8_STRING’ no se declaró en este ámbito
src/emX11/emX11Clipboard.cpp:193: error: ‘MY_XA_CLIPBOARD’ no se declaró en este ámbito
src/emX11/emX11Clipboard.cpp:195: error: ‘SelAtom’ no se declaró en este ámbito
src/emX11/emX11Clipboard.cpp:196: error: ‘XA_PRIMARY’ no se declaró en este ámbito
src/emX11/emX11Clipboard.cpp:197: error: ‘LocalTimestamp’ no se declaró en este ámbito
src/emX11/emX11Clipboard.cpp:197: error: ‘CurrentTime’ no se declaró en este ámbito
src/emX11/emX11Clipboard.cpp:200: error: ‘LastSelectionEvent’ no se declaró en este ámbito
src/emX11/emX11Clipboard.cpp:202: error: ‘xswa’ no se declaró en este ámbito
src/emX11/emX11Clipboard.cpp:203: error: ‘True’ no se declaró en este ámbito
src/emX11/emX11Clipboard.cpp:204: error: ‘Win’ no se declaró en este ámbito
src/emX11/emX11Clipboard.cpp:205: error: ‘class emX11Screen’ no tiene un miembro llamado ‘RootWin’
src/emX11/emX11Clipboard.cpp:205: error: ‘CopyFromParent’ no se declaró en este ámbito
src/emX11/emX11Clipboard.cpp:206: error: ‘InputOnly’ no se declaró en este ámbito
src/emX11/emX11Clipboard.cpp:206: error: ‘CWOverrideRedirect’ no se declaró en este ámbito
src/emX11/emX11Clipboard.cpp:207: error: ‘XCreateWindow’ no se declaró en este ámbito
src/emX11/emX11Clipboard.cpp:208: error: ‘XStoreName’ no se declaró en este ámbito
src/emX11/emX11Clipboard.cpp: In destructor ‘virtual emX11Clipboard::~emX11Clipboard()’:
src/emX11/emX11Clipboard.cpp:220: error: ‘Disp’ no se declaró en este ámbito
src/emX11/emX11Clipboard.cpp:220: error: ‘Win’ no se declaró en este ámbito
src/emX11/emX11Clipboard.cpp:220: error: ‘XDestroyWindow’ no se declaró en este ámbito
src/emX11/emX11Clipboard.cpp: At global scope:
src/emX11/emX11Clipboard.cpp:224: error: expected constructor, destructor, or type conversion before ‘*’ token
---
Building emX11 failed!El 23 de abril de 2009 13:17, Hernan Olivera <lholivera@gmail.com> escribió:2009/4/23 Marcos Guglielmetti <marcos@ovejafm.com>--El Jue 23 Abr 2009, Hernan Olivera escribió:
| Ojo que da error al compilar, si alguien lo resuelve que chifle!qué error da y en qué entorno ? así se lo pasamos a los
desarrolladores
Ya se los pase en el foro help. Probe en dos maquinas distintas, las dos con ubuntu.
En esta maquina es:
hernan@hernan-ubuntu:~/eaglemode-0.75.0$ perl make.pl build
### defaults ###
### emCore ###
gcc -O2 -fPIC -fexceptions -fmessage-length=0 -Wall -Winline -Wpointer-arith -Wredundant-decls -Wsign-compare -Wwrite-strings -Wsign-promo -Wsynth -Wstrict-aliasing=2 -Wno-invalid-offsetof -Iinclude -c src/emCore/emATMatrix.cpp -o obj/emATMatrix.o
gcc: error trying to exec 'cc1plus': execvp: No existe el fichero ó directorio
---
Building emCore failed!
y no encontre el cc1plus en ningun lado.
En la otra el dump es larguisimo, pero arranca con headers que no estan (.h) y despues una pila enorme de errores de sintaxis, casi como si estuviera haciendo la compilacion de un archivo de otro lenguaje
saludos
Hernan Olivera
--
Hernan Olivera
_______________________________________________
Solar-general mailing list
Solar-general@lists.ourproject.org
https://lists.ourproject.org/cgi-bin/mailman/listinfo/solar-general